{"text_format":"1","workbook":"xlsx","n_sheets":5,"sheets":["Version","Funktion","Auslegung","Datenblatt","Rechnung"],"not_rendered":{"charts":0,"images":19,"macros":1,"external_links":0,"defined_names":1,"comments":1,"pivot_tables":0},"unopened":[],"bounds":{"document_bytes":16777216,"sheet_cells":100000,"rows_first":2000,"rows_last":500,"rows_between":2000,"halvings":0,"cell_chars":16384,"cell_head_chars":4096},"cells_cut":0,"cells_raw":0,"read":"whole","date_system":"1900"}

{"sheet":"Version","index":0,"n_rows":2,"n_cols":2,"rows_kept":2,"cut":false,"hidden":true,"merged":[]}
["Service",{"$f":"MID(CELL(\"dateiname\"),FIND(\"[\",CELL(\"dateiname\"))+1,FIND(\"]\",CELL(\"dateiname\"))-FIND(\"[\",CELL(\"dateiname\"))-1)","v":"660_Auslegungstool_SDA_201030.xlsm"}]
["Version:","1.0"]

{"sheet":"Funktion","index":1,"n_rows":25,"n_cols":1,"rows_kept":25,"cut":false,"hidden":false,"merged":[[24,0,35,14]]}
[]
["Schlitzdüsendurchlass SDA für den Einbau in Doppelböden"]
[]
[]
[]
[]
[]
[]
[]
[]
[]
[]
[]
[]
[]
[]
[]
[]
[]
[]
[]
[]
[]
[]
["Begehbarer Schlitzdüsendurchlass zum Einbau in Doppelböden in ein- oder zweireihiger Ausführung. Eingriff- und Stolpersicher durch geringe Einzelschlitzbreiten in den Düsen (2mm), sowie geringe Aufbauhöhe der Auflageprofile (1mm).\n\nBestehend aus einem Aluminium Frontprofil mit integrierten Düsenelementen aus ABS zur Erzeugung unterschiedlicher Strahlformen, je nach räumlichen Anforderungen. Fronten in unterschiedlichen Eloxal- oder RAL-Farben mit Auflageprofilen zum luftdichten Einschieben in den Anschlusskasten. Zusätzliches Mitten-Zierprofil aus Aluminium in Eloxal- oder RAL-Farben für filigranere Optik des Schlitzdurchlasses erhältlich.\n\nDurch die variable Einstecktiefe des Frontprofiles sind Bodenaufbauten (Bodenplatte und Bodenbelag) von bis zu 50mm möglich. Anschlusskasten aus verzinktem Stahlblech, höhenverstellbar zum Ausgleich unterschiedlicher Bodenhöhen. Ausführung in Bandmontage möglich. Werkzeugloser Ausbau der Frontprofile zur einfachen Reinigung der Front und des Anschlusskastens gemäß VDI 6022. Anschluss über Rund- oder Ovalstutzen möglich."]

{"sheet":"Auslegung","index":2,"n_rows":78,"n_cols":7,"rows_kept":78,"cut":false,"hidden":false,"merged":[[1,0,1,3],[8,3,8,4],[9,3,9,4],[77,3,77,4],[76,3,76,4],[75,3,75,4],[74,3,74,4],[73,3,73,4],[72,3,72,4],[71,3,71,4],[65,3,65,4],[64,3,64,4],[63,3,63,4],[62,3,62,4],[61,3,61,4],[70,3,70,4],[6,6,6,8],[22,3,22,4],[21,3,21,4],[20,3,20,4],[60,3,60,4],[55,3,55,4],[51,3,51,4],[26,3,26,4],[23,3,23,4],[6,3,6,4],[19,3,19,4],[25,3,25,4],[14,3,14,4],[13,3,13,4],[12,3,12,4],[7,3,7,4],[59,3,59,4],[58,3,58,4],[57,3,57,4],[56,3,56,4],[54,3,54,4]]}
[]
["Auslegung Kampmann SDA"]
[]
["Eingabefelder sind gelb gekennzeichnet"]
["Ergebnisfelder sind blau gekennzeichnet"]
[]
["Vorgaben",null,null,null,null,null,"Skizzen der Stutzen"]
["Strömungstechnik und Akustik","Symbol","Einheit","Wert"]
["Länge","L","mm",1000]
["Anzahl Schlitze","n","-",2]
[null,null,null,1]
[null,null,null,2]
["Luftvolumenstrom","V°SUP","m³/h",100]
["Temperatur Zuluft","tSUP","°C",22]
["Temperatur Raum","tRaum","°C",26]
[]
["Stutzentyp","-","-","DN80 oder Oval128x51","Oval207x51"]
["Stutzenanzahl ","nStutzen","-",{"$f":"Rechnung!$H$108","v":4},{"$f":"Rechnung!$H$109","v":2}]
[]
["Raumdaten"]
["Raumhöhe","H1","m",3]
["Obergrenze Aufenthaltsbereich","H2","m",1.8]
["Raumlänge","LR","m",10]
["Raumbreite","BR","m",10]
[]
["Akustikdaten"]
["Raumart nach VDI 2081",null,null,"Großraumbüro"]
[null,null,null,"Einzelbüro"]
[null,null,null,"Großraumbüro"]
[null,null,null,"Werkstätten"]
[null,null,null,"Ruheraum, Pausenraum"]
[null,null,null,"Untersuchungsraum Krankenhaus"]
[null,null,null,"Rundfunk-, Fernsehstudio"]
[null,null,null,"Chemielabor"]
[null,null,null,"Wasch- und WC-Raum, Umkleide"]
[null,null,null,"EDV-Raum"]
[null,null,null,"Konzertsaal"]
[null,null,null,"Lesesaal"]
[null,null,null,"Museum"]
[null,null,null,"Küche"]
[null,null,null,"Theater, Kino"]
[null,null,null,"Klassen- Seminarraum"]
[null,null,null,"Gaststätte"]
[null,null,null,"kein Typ"]
[null,null,null,"Konferenzraum"]
[null,null,null,"Hotelzimmer"]
[null,null,null,"Hörsaal"]
[null,null,null,"Bettenzimmer Krankenhaus"]
[null,null,null,"Verkaufsraum"]
[null,null,null,"Sporthalle"]
[]
["Abstand zur Schallquelle","r","m",3]
[]
["Berechnung strömungstechnischer und akustischer Daten"]
["Luftlenkeinstellung","-","-","einseitig 20° zur Vertikalen in Richtung Wand"]
["Druckverlust","Δpt","Pa",{"$f":"Rechnung!$C$58","v":10.726347570967045}]
["Vertikale Wurfhöhe","yv","m",{"$f":"IF(Rechnung!$C$73-D21>0,\"\",IF(D14>=D15,\"-\",Rechnung!$C$73))","v":""}]
["Nahzone*","LN","m",{"$f":"Rechnung!G77","v":""}]
["Geschwindigkeit im Fußbodenbereich ab Nahzone","vx1","m/s",{"$f":"Rechnung!G76","v":""}]
["Zugluftrisiko ab Nahzone**","DR1","%",{"$f":"Rechnung!H75","v":0}]
["Kritischer Strahlweg","xkr","m",{"$f":"IF(Rechnung!$C$75<D23,Rechnung!$C$75,\"größer Raumlänge\")","v":0.8317256012627593}]
["Geschwindigkeit nach Ablösen an Xkr.","vx2","m/s",{"$f":"IF(Rechnung!$C$75<D23,Rechnung!$C$78,\"-\")","v":0.22096975067877495}]
["Zugluftrisiko im Aufenthaltsbereich**","DR2","%",{"$f":"IF(Rechnung!$C$75<D23,Rechnung!$C$80,\"-\")","v":16.607189810952619}]
["Resultierende Raumkategorie","RAL","[-]",{"$f":"Rechnung!$C$69","v":"B"}]
["Schallleistungspegel, Zuluftdurchlass","LWA_SUP","dB(A)",{"$f":"Rechnung!$D$57","v":"< 25"}]
["Schallldruckpegel in o.g. Entfernung zum Luftdurchlass","LPA_SUP","dB(A)",{"$f":"IF(D65=\"< 25\",\"\",D65+Rechnung!$Z$32)","v":""}]
["* Abstand zur Wand bei einem wandnahen Einbau (< 0,3m) des Auslasses"]
["** Berechnung gemäß DIN EN ISO 7730"]
[]
[]
["Oktavspektrum Schallleistung","LW_Okt","dB"]
[null,"LW, 125","dB",{"$f":"IF($D$65=\"< 25\",\"\",Rechnung!$AI$31)","v":""}]
[null,"LW, 250","dB",{"$f":"IF($D$65=\"< 25\",\"\",Rechnung!$AJ$31)","v":""}]
[null,"LW, 500","dB",{"$f":"IF($D$65=\"< 25\",\"\",Rechnung!$AK$31)","v":""}]
[null,"LW, 1000","dB",{"$f":"IF($D$65=\"< 25\",\"\",Rechnung!$AL$31)","v":""}]
[null,"LW, 2000","dB",{"$f":"IF($D$65=\"< 25\",\"\",Rechnung!$AM$31)","v":""}]
[null,"LW, 4000","dB",{"$f":"IF($D$65=\"< 25\",\"\",Rechnung!$AN$31)","v":""}]
[null,"LW, 8000","dB",{"$f":"IF($D$65=\"< 25\",\"\",Rechnung!$AO$31)","v":""}]

{"sheet":"Datenblatt","index":3,"n_rows":43,"n_cols":5,"rows_kept":43,"cut":false,"hidden":false,"merged":[[1,1,1,5],[2,1,2,5],[3,1,3,3],[18,0,18,3],[42,3,42,4],[41,3,41,4],[40,3,40,4],[39,3,39,4],[38,3,38,4],[37,3,37,4],[36,3,36,4],[31,3,31,4],[30,3,30,4],[29,3,29,4],[28,3,28,4],[27,3,27,4],[26,3,26,4],[21,3,21,4],[17,3,17,4],[16,3,16,4],[15,3,15,4],[22,3,22,4],[23,3,23,4],[24,3,24,4],[25,3,25,4],[20,3,20,4],[6,3,6,4],[5,3,5,4],[14,3,14,4],[11,3,11,4],[10,3,10,4],[9,3,9,4]]}
[]
["Projekt:","Hier Angaben zum Projekt."]
["Beschreibung:","Hier zusätzliche Informationen."]
["Sachbearbeiter","Hier Namen eintragen.",null,null,{"$f":"TODAY()","v":"2021-01-04"}]
[]
["Länge","L","mm",{"$f":"Auslegung!D9","v":1000}]
["Anzahl Schlitze","n","-",{"$f":"Auslegung!$D$10","v":2}]
["Stutzentyp","-","-",{"$f":"Auslegung!D17","v":"DN80 oder Oval128x51"},{"$f":"Auslegung!E17","v":"Oval207x51"}]
["Anzahl Stutzen","nStutzen","-",{"$f":"Auslegung!D18","v":4},{"$f":"Auslegung!E18","v":2}]
["Luftvolumenstrom","V°SUP","m³/h",{"$f":"Auslegung!D13","v":100}]
["Temperatur Zuluft","tSUP","°C",{"$f":"Auslegung!D14","v":22}]
["Temperatur Raum","tRaum","°C",{"$f":"Auslegung!D15","v":26}]
[]
["Raumdaten"]
["Raumhöhe","H1","m",{"$f":"Auslegung!D21","v":3}]
["Obergrenze Aufenthaltsbereich","H2","m",{"$f":"Auslegung!D22","v":1.8}]
["Raumlänge","LR","m",{"$f":"Auslegung!D23","v":10}]
["Raumbreite","BR","m",{"$f":"Auslegung!D24","v":10}]
[]
["Strömungstechnik und Akustik"]
[{"$f":"Auslegung!A55","v":"Luftlenkeinstellung"},"-","-",{"$f":"Auslegung!D55","v":"einseitig 20° zur Vertikalen in Richtung Wand"}]
[{"$f":"Auslegung!A56","v":"Druckverlust"},"Δpt","Pa",{"$f":"Auslegung!D56","v":10.726347570967045}]
[{"$f":"Auslegung!A57","v":"Vertikale Wurfhöhe"},"yv","m",{"$f":"Auslegung!$D$57","v":""}]
["Nahzone*","LN","m",{"$f":"Auslegung!$D$58","v":""}]
[{"$f":"Auslegung!A59","v":"Geschwindigkeit im Fußbodenbereich ab Nahzone"},"vx1","m/s",{"$f":"Auslegung!D59","v":""}]
[{"$f":"Auslegung!A60","v":"Zugluftrisiko ab Nahzone**"},"DR1","%",{"$f":"Auslegung!D60","v":0}]
[{"$f":"Auslegung!A61","v":"Kritischer Strahlweg"},"xkr","m",{"$f":"Auslegung!D61","v":0.8317256012627593}]
[{"$f":"Auslegung!A62","v":"Geschwindigkeit nach Ablösen an Xkr."},"vx2","m/s",{"$f":"Auslegung!D62","v":0.22096975067877495}]
[{"$f":"Auslegung!A63","v":"Zugluftrisiko im Aufenthaltsbereich**"},"DR2","%",{"$f":"Auslegung!D63","v":16.607189810952619}]
[{"$f":"Auslegung!A64","v":"Resultierende Raumkategorie"},"RAL","[-]",{"$f":"Auslegung!D64","v":"B"}]
[{"$f":"Auslegung!A65","v":"Schallleistungspegel, Zuluftdurchlass"},"LWA_SUP","dB(A)",{"$f":"Auslegung!D65","v":"< 25"}]
[{"$f":"Auslegung!A66","v":"Schallldruckpegel in o.g. Entfernung zum Luftdurchlass"},"LPA_SUP","dB(A)",{"$f":"Auslegung!D66","v":""}]
["* Abstand zur Wand bei einem wandnahen Einbau (< 0,3m) des Auslasses"]
["** Berechnung gemäß DIN EN ISO 7730"]
[]
["Oktavspektrum Schallleistung"]
[null,"LW, 125","dB",{"$f":"Auslegung!D72","v":""}]
[null,"LW, 250","dB",{"$f":"Auslegung!D73","v":""}]
[null,"LW, 500","dB",{"$f":"Auslegung!D74","v":""}]
[null,"LW, 1000","dB",{"$f":"Auslegung!D75","v":""}]
[null,"LW, 2000","dB",{"$f":"Auslegung!D76","v":""}]
[null,"LW, 4000","dB",{"$f":"Auslegung!D77","v":""}]
[null,"LW, 8000","dB",{"$f":"Auslegung!D78","v":""}]

{"sheet":"Rechnung","index":4,"n_rows":109,"n_cols":55,"rows_kept":109,"cut":false,"hidden":true,"merged":[[33,18,37,18],[59,1,61,15],[27,21,27,23],[28,21,28,22]]}
[]
[null,"SDA Konstanten - BA Jens Knöpker"]
[]
[null,"Bearbeiter:","A. Lühn"]
[null,"Datum","2020-03-31"]
[]
[]
[null,"Eindringtiefe Wandstrahl",null,null,null,null,null,null,null,"Luftgeschwindigkeit Bodenstrahl",null,null,null,null,null,"Kritischer Strahlweg Deckenstrahl",null,null,null,null,null,"Schallleistungspegel",null,null,null,null,null,null,null,null,null,null,null,"Unbewertete Schallleistungspegel in den einzelnen Terz- und Oktavbändern"]
[]
[]
[]
[null,null,null,null,null,null,null,null,null,null,null,null,null,null,null,null,null,null,null,null,null,"K1",-77.267506490062033]
[null,"K1",2.0598959999999999E-2,null,null,null,null,null,null,"K1",2.3847E-3,null,null,null,null,null,null,null,null,null,null,"K2",55.139598572365713]
[null,"K2",1.2873481600000001,null,null,null,null,null,null,"K2",0.4,null,null,null,null,"K1",5.04917119]
[null,"K3",0.40338908000000001,null,null,null,null,null,null,"K3",0.42870587999999998,null,null,null,null,"K2",1.54350184]
[null,null,null,null,null,null,null,null,null,null,null,null,null,null,null,"K3",0.20309315,null,null,null,null,"Luftseitiger Druckverlust"]
[]
[null,"Luftgeschwindigkeiten Wandstrahl",null,null,null,null,null,null,null,"Zugluftrisiko Bodenstrahl",null,null,null,null,null,"Luftgeschwindigkeit Deckenstrahl"]
[]
[null,null,null,null,null,null,null,null,null,null,null,null,null,null,null,null,null,null,null,null,null,"K1",4.7000000000000002E-3,null,null,null,null,null,null,null,null,null,null,"k1",-28.850662195804027,-42.53190003035391,-38.516034327987633,-41.43047333678944,-55.020710601202694,-48.681259542076702,-48.788370784436488,-66.37810665057593,-81.192526453418282,-97.035947553708553,-107.21267465558076,-112.37251078379944,-109.30260951216854,-115.66177702768121,-109.87060190775949,-81.002914149563722,-41.514659228130064,-12.264029851739567,7.68470467047797,17.824532711435147,22.240732046255257]
[null,null,null,null,null,null,null,null,null,null,null,null,null,null,null,null,null,null,null,null,null,"K2",1.9766999999999999,null,null,null,null,null,null,null,null,null,null,"k2",29.838742120864197,35.363512784523493,33.421571819258595,36.471434501013462,43.141545164565393,40.669916476383115,41.620451201221371,48.739885837172196,54.139945221217907,60.484692317269442,64.073199777493272,65.003917349662572,63.354727155313284,66.00006411876484,64.592577881310945,48.659217022141839,28.172677202426215,13.896735262364484,4.9034625628921358,0.69477517899880048,-0.23919347609930722]
[null,null,null,null,null,null,null,null,null,null,null,null,null,null,null,null,null,null,null,null,null,null,null,null,null,null,null,null,null,null,null,null,null,"k3",2.7263036782797974,-0.20634945294162352,-0.24675037172484757,-7.4059237567742153,-14.760753402859978,-15.282254997381257,-18.037950628600097,-16.075480706836892,-15.071583558303718,-18.929227611878961,-21.973078207261747,-22.635149296068715,-24.809724156095108,-21.833925094356996,-28.369627472216333,-18.509581060544104,-8.0865636657153086,-2.353388011704618,1.7053680985034427,2.7452876357023466,3.0258133268098497]
[null,null,null,null,null,null,null,null,null,"K1",5.8281479999999997E-2]
[null,null,null,null,null,null,null,null,null,"K2",0.12111263,null,null,null,null,"K1",0.86472391000000004]
[null,"K1",2.5570269999999999E-2,null,null,null,null,null,null,"K3",0.70602341000000002,null,null,null,null,"K2",1.0241943]
[null,"K2",0.4,null,null,null,null,null,null,"K4",8.0852209999999994E-2,null,null,null,null,"K3",0.59373799000000005]
[null,"K3",49.172991260000003,null,null,null,null,null,null,"K5",1.46397716,null,null,null,null,null,null,null,null,null,null,null,null,null,null,"Nachhallzeit","Richtungdfaktor","Raumvolumen","Absoprtionsfläche",null,null,null,null,"Terzbänder",100,125,160,200,250,315,400,500,630,800,1000,1250,1600,2000,2500,3150,4000,5000,6300,8000,10000]
[null,"K4",4.0341059000000001,null,null,null,null,null,null,null,null,null,null,null,null,null,null,null,null,null,null,"T[s] nach VDI 2081",null,null,null,"TN","Q","V","A ",null,null,null,null,null,{"$f":"AI$20+AI$21*LOG($C$56)+AI$22*LOG(Auslegung!$D$9*Auslegung!$D$10/1000)","v":22.66516481911323},{"$f":"AJ$20+AJ$21*LOG($C$56)+AJ$22*LOG(Auslegung!$D$9*Auslegung!$D$10/1000)","v":17.487530063580547},{"$f":"AK$20+AK$21*LOG($C$56)+AK$22*LOG(Auslegung!$D$9*Auslegung!$D$10/1000)","v":18.191934427364288},{"$f":"AL$20+AL$21*LOG($C$56)+AL$22*LOG(Auslegung!$D$9*Auslegung!$D$10/1000)","v":18.303994699148706},{"$f":"AM$20+AM$21*LOG($C$56)+AM$22*LOG(Auslegung!$D$9*Auslegung!$D$10/1000)","v":13.832051041241488},{"$f":"AN$20+AN$21*LOG($C$56)+AN$22*LOG(Auslegung!$D$9*Auslegung!$D$10/1000)","v":15.815291474551904},{"$f":"AO$20+AO$21*LOG($C$56)+AO$22*LOG(Auslegung!$D$9*Auslegung!$D$10/1000)","v":16.493563173855051},{"$f":"AP$20+AP$21*LOG($C$56)+AP$22*LOG(Auslegung!$D$9*Auslegung!$D$10/1000)","v":11.590295514066044},{"$f":"AQ$20+AQ$21*LOG($C$56)+AQ$22*LOG(Auslegung!$D$9*Auslegung!$D$10/1000)","v":6.2526177806206196},{"$f":"AR$20+AR$21*LOG($C$56)+AR$22*LOG(Auslegung!$D$9*Auslegung!$D$10/1000)","v":2.746510889902698E-2},{"$f":"AS$20+AS$21*LOG($C$56)+AS$22*LOG(Auslegung!$D$9*Auslegung!$D$10/1000)","v":-4.9687857892467413},{"$f":"AT$20+AT$21*LOG($C$56)+AT$22*LOG(Auslegung!$D$9*Auslegung!$D$10/1000)","v":-8.7466639368341461},{"$f":"AU$20+AU$21*LOG($C$56)+AU$22*LOG(Auslegung!$D$9*Auslegung!$D$10/1000)","v":-9.133299597532524},{"$f":"AV$20+AV$21*LOG($C$56)+AV$22*LOG(Auslegung!$D$9*Auslegung!$D$10/1000)","v":-10.10231418212777},{"$f":"AW$20+AW$21*LOG($C$56)+AW$22*LOG(Auslegung!$D$9*Auslegung!$D$10/1000)","v":-8.6698584196240471},{"$f":"AX$20+AX$21*LOG($C$56)+AX$22*LOG(Auslegung!$D$9*Auslegung!$D$10/1000)","v":-3.9043031008658247},{"$f":"AY$20+AY$21*LOG($C$56)+AY$22*LOG(Auslegung!$D$9*Auslegung!$D$10/1000)","v":3.9155760554064716},{"$f":"AZ$20+AZ$21*LOG($C$56)+AZ$22*LOG(Auslegung!$D$9*Auslegung!$D$10/1000)","v":10.63766613425722},{"$f":"BA$20+BA$21*LOG($C$56)+BA$22*LOG(Auslegung!$D$9*Auslegung!$D$10/1000)","v":16.528907433514309},{"$f":"BB$20+BB$21*LOG($C$56)+BB$22*LOG(Auslegung!$D$9*Auslegung!$D$10/1000)","v":19.831348825383156},{"$f":"BC$20+BC$21*LOG($C$56)+BC$22*LOG(Auslegung!$D$9*Auslegung!$D$10/1000)","v":22.745210077779255}]
[null,"K5",0.63914031000000004,null,null,null,null,null,null,null,null,null,null,null,null,"Zugluftrisiko Deckenstrahl",null,null,null,null,null,"Raumart",null,"s",null,{"$f":"VLOOKUP(Auslegung!D27,Rechnung!V30:X53,3)","v":0.5},4,{"$f":"Auslegung!$D$21*Auslegung!$D$23*Auslegung!$D$24","v":300},{"$f":"0.163*AB29/Z29","v":97.8}]
[null,null,null,null,null,null,null,null,null,"Temperaturen Bodenstrahl",null,null,null,null,null,null,null,null,null,null,null,"Einzelbüro",null,0.5,null,null,null,null,null,null,null,null,null,"Oktavbänder",125,250,500,1000,2000,4000,8000]
[null,null,null,null,null,null,null,null,null,null,null,null,null,null,null,null,null,null,null,null,null,"Großraumbüro",null,0.5,null,"Pegelminderung",null,null,null,null,null,null,null,null,{"$f":"IF(10*LOG(10^(0.1*AJ28)+10^(0.1*AK28)+10^(0.1*AI28))<0,0,10*LOG(10^(0.1*AJ28)+10^(0.1*AK28)+10^(0.1*AI28)))","v":24.867714682154578},{"$f":"IF(10*LOG(10^(0.1*AM28)+10^(0.1*AN28)+10^(0.1*AL28))<0,0,10*LOG(10^(0.1*AM28)+10^(0.1*AN28)+10^(0.1*AL28)))","v":21.139085126856415},{"$f":"IF(10*LOG(10^(0.1*AP28)+10^(0.1*AQ28)+10^(0.1*AO28))<0,0,10*LOG(10^(0.1*AP28)+10^(0.1*AQ28)+10^(0.1*AO28)))","v":18.010182740953805},{"$f":"IF(10*LOG(10^(0.1*AS28)+10^(0.1*AT28)+10^(0.1*AR28))<0,0,10*LOG(10^(0.1*AS28)+10^(0.1*AT28)+10^(0.1*AR28)))","v":1.6384911570405087},{"$f":"IF(10*LOG(10^(0.1*AV28)+10^(0.1*AW28)+10^(0.1*AU28))<0,0,10*LOG(10^(0.1*AV28)+10^(0.1*AW28)+10^(0.1*AU28)))","v":0},{"$f":"IF(10*LOG(10^(0.1*AY28)+10^(0.1*AZ28)+10^(0.1*AX28))<0,0,10*LOG(10^(0.1*AY28)+10^(0.1*AZ28)+10^(0.1*AX28)))","v":11.599295597246289},{"$f":"IF(10*LOG(10^(0.1*BB28)+10^(0.1*BC28)+10^(0.1*BA28))<0,0,10*LOG(10^(0.1*BB28)+10^(0.1*BC28)+10^(0.1*BA28)))","v":25.176115679402663}]
[null,"Zugluftrisiken Wandstrahl",null,null,null,null,null,null,null,null,null,null,null,null,null,null,null,null,null,null,null,"Werkstätten",null,1.5,null,{"$f":"10*LOG($AA$29/(4*PI()*Auslegung!$D$52^2)+4/Rechnung!$AC$29)","v":-11.17660144010693}]
[null,null,null,null,null,null,null,null,null,null,null,null,null,null,null,null,null,null,null,null,null,"Ruheraum, Pausenraum",null,1]
[null,null,null,null,null,null,null,null,null,null,null,null,null,null,null,"K1",0.28475208000000002,515.01958329931495,"Neue Konstanten gerechnet, um auf Basis der Anfanggeschindigkeit an der Decke das DR zu bestimmen. Quelle: I:\\EMCO\\daten_EK\\Bachelor- Masterarbeiten\\Jens Knöpker\\SDA-19\\Messdaten_SDA-19\\zur Wand\\Auswertung_Deckenstrahl_180807.xlsx",null,null,"Untersuchungsraum Krankenhaus",null,2]
[null,null,null,null,null,null,null,null,null,"K1",0.42196994999999998,null,null,null,null,"K2",0.38340723999999998,41.56353843282298,null,null,null,"Rundfunk-, Fernsehstudio",null,0.5]
[null,null,null,null,null,null,null,null,null,"K2",1.5837621799999999,null,null,null,null,"K3",0.57701822999999997,0.38425848861234296,null,null,null,"Chemielabor",null,2]
[null,"K1",2.8246249300000001,null,null,null,null,null,null,"K3",0.72772974000000001,null,null,null,null,"K4",1.0623087099999999,-40.090580818260875,null,null,null,"Wasch- und WC-Raum, Umkleide",null,2]
[null,"K2",1.7702789299999999,null,null,null,null,null,null,null,null,null,null,null,null,"K5",1.07181277,-0.2422777802382802,null,null,null,"Schwimmbad",null,2]
[null,"K3",0.92654778000000004,null,null,null,null,null,null,null,null,null,null,null,null,null,null,null,null,null,null,"EDV-Raum",null,1.5]
[null,"K4",0.14811748,null,null,null,null,null,null,null,null,null,null,null,null,null,null,null,null,null,null,"Konzertsaal",null,1.5]
[null,"K5",2.89916785,null,null,null,null,null,null,null,null,null,null,null,null,"Temperaturen Deckenstrahl",null,null,null,null,null,"Lesesaal",null,1]
[null,null,null,null,null,null,null,null,null,null,null,null,null,null,null,null,null,null,null,null,null,"Museum",null,1.5]
[null,null,null,null,null,null,null,null,null,null,null,null,null,null,null,null,null,null,null,null,null,"Küche",null,1.5]
[null,"Temperatur Wandstrahl",null,null,null,null,null,null,null,null,null,null,null,null,null,null,null,null,null,null,null,"Theater, Kino",null,1]
[null,null,null,null,null,null,null,null,null,null,null,null,null,null,null,null,null,null,null,null,null,"Klassen- Seminarraum",null,1]
[null,null,null,null,null,null,null,null,null,null,null,null,null,null,null,"K1",0.39186400999999998,null,null,null,null,"Gaststätte",null,1]
[null,null,null,null,null,null,null,null,null,null,null,null,null,null,null,"K2",1.57097978,null,null,null,null,"kein Typ",null,"x"]
[null,null,null,null,null,null,null,null,null,null,null,null,null,null,null,"K3",0.42108082000000002,null,null,null,null,"Konferenzraum",null,1]
[null,"K1",0.55954946999999999,null,null,null,null,null,null,null,null,null,null,null,null,null,null,null,null,null,null,"Hotelzimmer",null,0.5]
[null,"K2",1.1714559,null,null,null,null,null,null,null,null,null,null,null,null,null,null,null,null,null,null,"Hörsaal",null,1]
[null,"K3",0.24367638899999999,null,null,null,null,null,null,null,null,null,null,null,null,null,null,null,null,null,null,"Bettenzimmer Krankenhaus",null,1]
[null,null,null,null,null,null,null,null,null,null,null,null,null,null,null,null,null,null,null,null,null,"Verkaufsraum",null,1]
[null,null,null,null,null,null,null,null,null,null,null,null,null,null,null,null,null,null,null,null,null,"Sporthalle",null,2]
[]
[null,"Übergabe:",null,"Tool",null,"max V°"]
[null,"spez. Volumenstrom",{"$f":"Auslegung!$D$13/(Auslegung!$D$10*Auslegung!$D$9/1000)","v":50}]
[null,"Schallleistungspegel",{"$f":"$W$12+$W$13*LOG(Auslegung!$D$13/(Auslegung!$D$10*Auslegung!$D$9/1000))+10*LOG((Auslegung!$D$10*Auslegung!$D$9)/1000)","v":19.423317492156286},{"$f":"IF(C57<25,\"< 25\",C57)","v":"< 25"},null,{"$f":"10^((48-$W$12-10*LOG(Auslegung!$D$9*Auslegung!$D$10/1000))/Rechnung!$W$13)*Auslegung!$D$9*Auslegung!$D$10/1000","v":329.80756975749608},{"$f":"10^((18-$W$12-10*LOG(Auslegung!$D$9*Auslegung!$D$10/1000))/Rechnung!$W$13)*Auslegung!$D$9*Auslegung!$D$10/1000","v":94.229528388951195}]
[null,"Druckverlust",{"$f":"$W$20*$C$56^$W$21","v":10.726347570967045}]
[]
[null,"Die Bestimmung der Behaglichkeitsparameter erfolgt auf Basis der Bachelorarbeit von Jens Knöpker. Damals wurden jedoch die ersten Prototypen der Kunststoffdüse vermessen, die drei Spalten a  2 mm besitzten. In der finalen Konstruktion sind jedoch nur 2 Spalten a 2,25 mm vorgesehen. Um die Messergebnisse aus der Bachelorarbeit verwendbar zu machen, wird auf Basis der gleichen Austrittsgeschwindigkeit gerechnet. Faktor 0,75! Des Weiteren wurde in der Bachelorarbeit ein 2-Schlitzer vermessen. Deshalb wird in einigen Rechnungen der Faktor Wurzel(1/2) verwendet, um den Einfluss der Luftmenge zu berücksichtigen."]
[]
[]
[]
[null,"Umrechnungsfaktor",0.75]
[null,"spez. V° für Rechnung",{"$f":"C56/C64","v":66.666666666666671}]
[null,"Schlitzanzahl",{"$f":"Auslegung!D10","v":2}]
[null,"Untertemperatur",{"$f":"Auslegung!D15-Auslegung!D14","v":4}]
[null,"Raumhöhe",{"$f":"Auslegung!$D$21","v":3}," "]
[null,"Raumkategorie",{"$f":"IF(AND(C80<10,G75<10),\"A\",IF(AND(C80<20,G75<20),\"B\",IF(AND(C80<30,G75<30),\"C\",\"Außerhalb von C\")))","v":"B"}]
[]
[null,"Deckenstrahl:",null,"Tool",null,"Misch-Quell-Lüftung:",null,"Tool"]
[]
[null,"vertikale Eindringtiefe",{"$f":"IFERROR(SQRT($C$66/2)*$C$13*($C$65^$C$14)/(($C$67)^Rechnung!$C$15)*M81,1000)","v":3.0473284392324382},{"$f":"IF($C$82<=0,C73,\"-\")","v":3.0473284392324382},null,"vertikale Eindringtiefe",{"$f":"IFERROR(SQRT($C$66/2)*$C$13*($C$65^$C$14)/(($C$67)^Rechnung!$C$15)*M81,1000)","v":3.0473284392324382},{"$f":"IF($C$82<=0,G73,\"-\")","v":3.0473284392324382},null,null,null,"Faktor für die Wandstrahl Geschwindigkeit - auf Basis der Bestätigungsmessungen im Mai.2020. A.Lühn"]
[null,"Geschwindigkeit Anfang Decke",{"$f":"IFERROR(IF(Auslegung!D21-Rechnung!C73>0,\"\",($C$25*C65*(($C$26/$C$68)^($C$29)-SQRT((($C$67)*$C$27)/(C65^2)*(2.83*SQRT($C$68/$C$26)-1))^$C$28))*SQRT($C$66/2)*M81),1000)","v":0.37305700618445758},{"$f":"IF($C$82<=0,C74,\"-\")","v":0.37305700618445758},null,"Luftgeschwindigkeit im Bodenbereich (Beginn Aufenthaltsbereich)",{"$f":"IFERROR(IF(Auslegung!D21-Rechnung!G73<0,\"\",$K$13*$C$65*(1/(1.3*$K$14))^$K$15*SQRT(Auslegung!$D$10/2)),1000)","v":""},{"$f":"IF($C$82<=0,G74,\"-\")","v":""}]
[null,"kritischer Strahlweg",{"$f":"IFERROR(IF(Auslegung!D21-Rechnung!C73>0,0,$Q$14*$C$74^$Q$15*(1/($C$67))^$Q$16),1000)","v":0.8317256012627593},{"$f":"IF($C$82<=0,C75,\"-\")","v":0.8317256012627593},null,"Zuluftrisiko im Bodenbereich (Beginn Nahzone)",{"$f":"IFERROR(IF(Auslegung!D21-Rechnung!G73<0,0,$K$23*$C$65*(1/($G$77*$K$24))^$K$25+$K$26*$C$67^$K$27),1000)","v":0},0]
[null,"Luftgeschwindigkeit Ablösepunkt",{"$f":"IFERROR(IF(Auslegung!D21-Rechnung!C73>0,\"\",$Q$24*$C$74*(1/($C$75*$Q$25))^$Q$26),1000)","v":0.35481268869528104},0.35481268869528104,null,"Grenzgeschwindigkeit für Nahzone",{"$f":"IFERROR(IF(Auslegung!D21-Rechnung!G73<0,\"\",0.2),1000)","v":""},""]
[null,"Lauflänge Decke - Aufenthaltsbereich (45°)",{"$f":"IFERROR(IF(Auslegung!D21-Rechnung!C73>0,\"\",(Auslegung!$D$21-Auslegung!$D$22)/SIN(45/180*PI())),1000)","v":1.697056274847714},1.697056274847714,null,"Nahzone",{"$f":"IFERROR(IF(Auslegung!D21-Rechnung!G73<0,\"\",1/((G76/($K$13*$C$65*SQRT(Auslegung!$D$10/2)))^(1/$K$15)*$K$14)),1000)","v":""},"",null,null,null,"Schlitzanzahl:"]
[null,"Geschwindigkeit Aufenthaltsbereich",{"$f":"IFERROR(IF(Auslegung!D21-Rechnung!C73>0,\"\",$Q$24*$C$76*(1/($C$77*$Q$25))^$Q$26),1000)","v":0.22096975067877495},0.22096975067877495,null,null,null,null,null,null,null,1,0.95710921462834297]
[null,"Temperatur Aufenthaltsbereich",{"$f":"IFERROR(IF(Auslegung!D21-Rechnung!C73>0,\"\",Auslegung!D15-($Q$46*(1/($Q$47*($C$75+$C$77)))^$Q$48*$C$67)),1000)","v":25.123133568875307},25.123133568875307,null,null,null,null,null,null,null,2,1.16126900558493]
[null,"Zugluftrisiko",{"$f":"IFERROR(IF(Auslegung!D21-Rechnung!C73>0,0,(34-$C$79)*($C$78-0.05)^0.62*(0.37*$C$78*30+3.14)),1000)","v":16.607189810952619},16.607189810952619]
{"$rows_left_out":29}